BDBM50442942 CHEMBL3087174
SMILES COc1nn(Cc2ccc(cc2)-c2ccccc2)c(=O)o1
InChI Key InChIKey=PZHGVPUUVVWCLI-UHFFFAOYSA-N
Data  8 IC50
  Tab Delimited (TSV)   2D SDfile   Computed 3D by Vconf -m prep SDfile
Find this compound or compounds like it in BindingDB:
Activity Spreadsheet -- Enzyme Inhibition Constant Data from BindingDB
Found 8 hits for monomerid = 50442942
TargetMonoglyceride lipase(Homo sapiens (Human))
University Of Eastern Finland
Curated by ChEMBL
LigandPNGBDBM50442942(CHEMBL3087174)
Affinity DataIC50:  1.60E+3nM. Assay description: Inhibition of human FAAH expressed in COS7 cell membranes pre-incubated for 10 mins before [3H]-AEA substrate addition by liquid scintillation counti...
In DepthDetails ArticlePubMed
TargetMonoglyceride lipase(Homo sapiens (Human))
University Of Eastern Finland
Curated by ChEMBL
LigandPNGBDBM50442942(CHEMBL3087174)
Affinity DataIC50:  1.62E+3nM. Assay description: Inhibition of human FAAH expressed in COS7 cell membranes pre-incubated for 10 mins before [3H]-AEA substrate addition by liquid scintillation counti...
In DepthDetails ArticlePubMed
TargetFatty-acid amide hydrolase 1(Homo sapiens (Human))
University Of Eastern Finland
Curated by ChEMBL
LigandPNGBDBM50442942(CHEMBL3087174)
Affinity DataIC50:  162nM. Assay description: Inhibition of human FAAH expressed in COS7 cell membranes pre-incubated for 10 mins before [3H]-AEA substrate addition by liquid scintillation counti...
In DepthDetails ArticlePubMed
TargetFatty-acid amide hydrolase 1(Homo sapiens (Human))
University Of Eastern Finland
Curated by ChEMBL
LigandPNGBDBM50442942(CHEMBL3087174)
Affinity DataIC50:  162nM. Assay description: Inhibition of human recombinant FAAH overexpressed in African green monkey COS7 cells using [3H]-anandamide as substrate preincubated for 10 mins bef...
In DepthDetails ArticlePubMed
TargetMonoglyceride lipase(Homo sapiens (Human))
University Of Eastern Finland
Curated by ChEMBL
LigandPNGBDBM50442942(CHEMBL3087174)
Affinity DataIC50:  1.62E+3nM. Assay description: Inhibition of human recombinant MAGL overexpressed in HEK cells using 2-AG as substrate preincubated for 10 mins before substrate addition measured a...
In DepthDetails ArticlePubMed
TargetMonoglyceride lipase(Homo sapiens (Human))
University Of Eastern Finland
Curated by ChEMBL
LigandPNGBDBM50442942(CHEMBL3087174)
Affinity DataIC50:  1.60E+3nM. Assay description: Inhibition of human recombinant MAGL overexpressed in HEK cells using 2-AG as substrate preincubated for 10 mins before substrate addition measured a...
In DepthDetails ArticlePubMed
TargetFatty-acid amide hydrolase 1(Homo sapiens (Human))
University Of Eastern Finland
Curated by ChEMBL
LigandPNGBDBM50442942(CHEMBL3087174)
Affinity DataIC50:  160nM. Assay description: Inhibition of human recombinant FAAH overexpressed in African green monkey COS7 cells using [3H]-anandamide as substrate preincubated for 10 mins bef...
In DepthDetails ArticlePubMed
TargetFatty-acid amide hydrolase 1(Homo sapiens (Human))
University Of Eastern Finland
Curated by ChEMBL
LigandPNGBDBM50442942(CHEMBL3087174)
Affinity DataIC50:  160nM. Assay description: Inhibition of human FAAH expressed in COS7 cell membranes pre-incubated for 10 mins before [3H]-AEA substrate addition by liquid scintillation counti...
In DepthDetails ArticlePubMed