BDBM50443039 CHEMBL3087797
SMILES CCN(CC)CCNS(=O)(=O)c1ccc(F)cc1
InChI Key InChIKey=NFCCDTZDLXJZOA-UHFFFAOYSA-N
Data  1 IC50
  Tab Delimited (TSV)   2D SDfile   Computed 3D by Vconf -m prep SDfile
Find this compound or compounds like it in BindingDB:
Activity Spreadsheet -- Enzyme Inhibition Constant Data from BindingDB
Found 1 hit for monomerid = 50443039
TargetAcetylcholinesterase(Mus musculus (mouse))
Ume£
Curated by ChEMBL
LigandPNGBDBM50443039(CHEMBL3087797)
Affinity DataIC50:  6.20E+4nM. Assay description: Inhibition of mouse recombinant AChE using acetylthiocholine iodide as substrate by Ellman's method
In DepthDetails ArticlePubMed