BDBM50443192 CHEMBL3086539
SMILES COc1ccc2nc(NC(=O)[C@H]3C[C@@H]3c3ccccc3)sc2c1
InChI Key InChIKey=PNGQTNOFXWGWDD-KGLIPLIRSA-N
Data  1 KI
  Tab Delimited (TSV)   2D SDfile   Computed 3D by Vconf -m prep SDfile
Find this compound or compounds like it in BindingDB:
Activity Spreadsheet -- Enzyme Inhibition Constant Data from BindingDB
Found 1 hit for monomerid = 50443192
TargetTyrosine-protein kinase ITK/TSK(Homo sapiens (Human))
Evotec (Uk)
Curated by ChEMBL
LigandPNGBDBM50443192(CHEMBL3086539)
Affinity DataKi:  460nM. Assay description: Inhibition of full length GST-tagged ITK (unknown origin) using Ac-EFPIYDFLPAKKK-NH2 as substrate after 35 mins by LC/MS analysis
In DepthDetails ArticlePubMed