BDBM50443446 CHEMBL3087439
SMILES CNc1nc(C)c(s1)-c1nc(Nc2cccc(c2)S(=O)(=O)N2CCN(C)CC2)ncc1C#N
InChI Key InChIKey=YKBWHMMFNLYZNJ-UHFFFAOYSA-N
Data  4 KI
  Tab Delimited (TSV)   2D SDfile   Computed 3D by Vconf -m prep SDfile
Find this compound or compounds like it in BindingDB:
Activity Spreadsheet -- Enzyme Inhibition Constant Data from BindingDB
Found 4 hits for monomerid = 50443446
TargetCyclin-H/Cyclin-dependent kinase 7(Homo sapiens (Human))
University Of Nottingham
Curated by ChEMBL
LigandPNGBDBM50443446(CHEMBL3087439)
Affinity DataKi:  24nM. Assay description: Inhibition of CDK7/Cyclin H (unknown origin) by radiometric assay
In DepthDetails ArticlePubMed
TargetCyclin-T1/Cyclin-dependent kinase 9(Homo sapiens (Human))
University Of Nottingham
Curated by ChEMBL
LigandPNGBDBM50443446(CHEMBL3087439)
Affinity DataKi:  35nM. Assay description: Inhibition of CDK9/Cyclin T1 (unknown origin) by radiometric assay
In DepthDetails ArticlePubMed
TargetCyclin-dependent kinase/G2/mitotic-specific cyclin- 1(Homo sapiens (Human))
University Of Nottingham
Curated by ChEMBL
LigandPNGBDBM50443446(CHEMBL3087439)
Affinity DataKi:  576nM. Assay description: Inhibition of CDK1/Cyclin B (unknown origin) by radiometric assay
In DepthDetails ArticlePubMed
TargetCyclin-A2/Cyclin-dependent kinase 2(Homo sapiens (Human))
University Of Nottingham
Curated by ChEMBL
LigandPNGBDBM50443446(CHEMBL3087439)
Affinity DataKi:  584nM. Assay description: Inhibition of CDK2/Cyclin A (unknown origin) by radiometric assay
In DepthDetails ArticlePubMed