BDBM50443706 CHEMBL3093831
SMILES CN(C)c1ccc(cc1)-c1cc(=O)c2ccc(OCCCCN3CCOCC3)cc2o1
InChI Key InChIKey=BYOLJIIINISJDP-UHFFFAOYSA-N
Data  2 IC50
  Tab Delimited (TSV)   2D SDfile   Computed 3D by Vconf -m prep SDfile
Find this compound or compounds like it in BindingDB:
Activity Spreadsheet -- Enzyme Inhibition Constant Data from BindingDB
Found 2 hits for monomerid = 50443706
TargetAcetylcholinesterase(Electrophorus electricus (Electric eel))
Henan University
Curated by ChEMBL
LigandPNGBDBM50443706(CHEMBL3093831)
Affinity DataIC50: >5.00E+4nM. Assay description: Inhibition of electric eel AChE using acetylthiocholine chloride as substrate incubated for 15 mins prior to substrate addition by Ellman's method
In DepthDetails ArticlePubMed
TargetCholinesterase(Equus caballus (Horse))
Henan University
Curated by ChEMBL
LigandPNGBDBM50443706(CHEMBL3093831)
Affinity DataIC50:  1.01E+4nM. Assay description: Inhibition of equine serum BChE using butylthiocholine chloride as substrate incubated for 15 mins prior to substrate addition by Ellman's method
In DepthDetails ArticlePubMed