BDBM50443726 CHEMBL3093883::US9238658, 12
SMILES CNC(=O)c1cccc(NC(=O)N2CCC(CC2)N2CCc3ccccc23)c1
InChI Key InChIKey=KXKYKKXNRALJNW-UHFFFAOYSA-N
Data  2 IC50
  Tab Delimited (TSV)   2D SDfile   Computed 3D by Vconf -m prep SDfile
Find this compound or compounds like it in BindingDB:
Activity Spreadsheet -- Enzyme Inhibition Constant Data from BindingDB
Found 2 hits for monomerid = 50443726
TargetAcyl-CoA desaturase 1(Rattus norvegicus (Rat))
Janssen Research And Development
Curated by ChEMBL
LigandPNGBDBM50443726(CHEMBL3093883 | US9238658, 12)
Affinity DataIC50:  151nM. Assay description: Inhibition of SCD1 in Sprague-Dawley rat liver microsomes using Stearoyl-[9,10-3H]-CoA as substrate assessed as [3H2O] generation
In DepthDetails ArticlePubMed
TargetAcyl-CoA desaturase 1(Rattus norvegicus (Rat))
Janssen Research And Development
Curated by ChEMBL
LigandPNGBDBM50443726(CHEMBL3093883 | US9238658, 12)
Affinity DataIC50:  151nMT: 2°C. Assay description: The SCD1 enzymatic assay was done in a volume of 50 uL using 10 ug of RLM (prepared as described above) in a 96-well polypropylene plate (enzyme reac...
In DepthDetails US Patent