BDBM50444082 CHEMBL3092803
SMILES CCCCNc1nccc(N[C@H]2CC[C@H](O)CC2)n1
InChI Key InChIKey=TWOVQCHDPBWOKT-HAQNSBGRSA-N
Data  3 IC50
  Tab Delimited (TSV)   2D SDfile   Computed 3D by Vconf -m prep SDfile
Find this compound or compounds like it in BindingDB:
Activity Spreadsheet -- Enzyme Inhibition Constant Data from BindingDB
Found 3 hits for monomerid = 50444082
TargetTyrosine-protein kinase receptor TYRO3(Homo sapiens (Human))
University Of North Carolina At Chapel Hill
Curated by ChEMBL
LigandPNGBDBM50444082(CHEMBL3092803)
Affinity DataIC50: >3.00E+4nM. Assay description: Inhibition of Tyro-3 kinase (unknown origin) using 5-FAM-EFPIYDFLPAKKK-CONH2 as substrate after 180 mins by microfluidic capillary electrophoresis as...
In DepthDetails ArticlePubMed
TargetTyrosine-protein kinase Mer(Homo sapiens (Human))
University Of North Carolina At Chapel Hill
Curated by ChEMBL
LigandPNGBDBM50444082(CHEMBL3092803)
Affinity DataIC50:  1.52E+4nM. Assay description: Inhibition of Mer kinase (unknown origin) using 5-FAM-EFPIYDFLPAKKK-CONH2 as substrate after 180 mins by microfluidic capillary electrophoresis assay
In DepthDetails ArticlePubMed
TargetTyrosine-protein kinase receptor UFO(Homo sapiens (Human))
University Of North Carolina At Chapel Hill
Curated by ChEMBL
LigandPNGBDBM50444082(CHEMBL3092803)
Affinity DataIC50: >3.00E+4nM. Assay description: Inhibition of Axl kinase (unknown origin) using 5-FAM-KKKKEEIYFFF-CONH2 as substrate after 180 mins by microfluidic capillary electrophoresis assay
In DepthDetails ArticlePubMed