BDBM50384035 CHEMBL2032158::CHEMBL2078645
SMILES CNc1ccc2oc(nc2c1)-c1cc(cnc1N)-c1cnn(c1)C1CCNCC1
InChI Key InChIKey=RDEKYROQCDTNPC-UHFFFAOYSA-N
Data  3 IC50
  Tab Delimited (TSV)   2D SDfile   Computed 3D by Vconf -m prep SDfile
Find this compound or compounds like it in BindingDB:
Activity Spreadsheet -- Enzyme Inhibition Constant Data from BindingDB
Found 3 hits for monomerid = 50384035
TargetG protein-coupled receptor kinase 5(Homo sapiens (Human))
Korea Research Institute Of Chemical Technology
Curated by ChEMBL
LigandPNGBDBM50384035(CHEMBL2032158 | CHEMBL2078645)
Affinity DataIC50:  660nM. Assay description: Inhibition of GRK-5 (unknown origin) preincubated with enzyme for 10 mins before adding peptide substrate and ATP measured after 1 hr by LANCE-TR-FRE...
In DepthDetails ArticlePubMed
TargetHepatocyte growth factor receptor(Homo sapiens (Human))
Korea Research Institute Of Chemical Technology
Curated by ChEMBL
LigandPNGBDBM50384035(CHEMBL2032158 | CHEMBL2078645)
Affinity DataIC50:  160nM. Assay description: Inhibition of recombinant c-Met by time resolved-fluorescence resonance energy transfer analysis
In DepthDetails ArticlePubMed
TargetBeta-adrenergic receptor kinase 1(Homo sapiens (Human))
Korea Research Institute Of Chemical Technology
Curated by ChEMBL
LigandPNGBDBM50384035(CHEMBL2032158 | CHEMBL2078645)
Affinity DataIC50:  6.32E+3nM. Assay description: Inhibition of GRK-2 (unknown origin) preincubated with enzyme for 10 mins before adding peptide substrate and ATP measured after 1 hr by LANCE-TR-FRE...
In DepthDetails ArticlePubMed