BDBM50444254 CHEMBL3093763
SMILES CCCCNc1ncc(C(=O)NC2CCN(CC2)C(C)C)c(N[C@H]2CC[C@H](O)CC2)n1
InChI Key InChIKey=CXDXWPGEWIRDBS-UAPYVXQJSA-N
Data  3 IC50
  Tab Delimited (TSV)   2D SDfile   Computed 3D by Vconf -m prep SDfile
Find this compound or compounds like it in BindingDB:
Activity Spreadsheet -- Enzyme Inhibition Constant Data from BindingDB
Found 3 hits for monomerid = 50444254
TargetTyrosine-protein kinase Mer(Homo sapiens (Human))
Eshelman School Of Pharmacy�Department Of Pharmacology�Lineberger Compreh
Curated by ChEMBL
LigandPNGBDBM50444254(CHEMBL3093763)
Affinity DataIC50:  8.40nM. Assay description: Inhibition of Mer kinase (unknown origin) using 5-FAM-EFPIYDFLPAKKK-CONH2 as substrate after 180 mins by microfluidic capillary electrophoresis assay
In DepthDetails ArticlePubMed
TargetTyrosine-protein kinase receptor UFO(Homo sapiens (Human))
Eshelman School Of Pharmacy�Department Of Pharmacology�Lineberger Compreh
Curated by ChEMBL
LigandPNGBDBM50444254(CHEMBL3093763)
Affinity DataIC50:  430nM. Assay description: Inhibition of Axl kinase (unknown origin) using 5-FAM-KKKKEEIYFFF-CONH2 as substrate after 180 mins by microfluidic capillary electrophoresis assay
In DepthDetails ArticlePubMed
TargetTyrosine-protein kinase receptor TYRO3(Homo sapiens (Human))
Eshelman School Of Pharmacy�Department Of Pharmacology�Lineberger Compreh
Curated by ChEMBL
LigandPNGBDBM50444254(CHEMBL3093763)
Affinity DataIC50:  190nM. Assay description: Inhibition of Tyro-3 kinase (unknown origin) using 5-FAM-EFPIYDFLPAKKK-CONH2 as substrate after 180 mins by microfluidic capillary electrophoresis as...
In DepthDetails ArticlePubMed