BDBM50444571 CHEMBL3099698
SMILES N#Cc1ccc([C@H]2CCCc3cncn23)c(c1)-c1ccccc1
InChI Key InChIKey=INZQCVVDTIOFTJ-HXUWFJFHSA-N
Data  1 IC50
  Tab Delimited (TSV)   2D SDfile   Computed 3D by Vconf -m prep SDfile
Find this compound or compounds like it in BindingDB:
Activity Spreadsheet -- Enzyme Inhibition Constant Data from BindingDB
Found 1 hit for monomerid = 50444571
TargetCytochrome P450 11B2, mitochondrial(Homo sapiens (Human))
Novartis Institutes For Biomedical Research
Curated by ChEMBL
LigandPNGBDBM50444571(CHEMBL3099698)
Affinity DataIC50:  56nM. Assay description: Inhibition of CYP11B2 in human NCI-H295R cells assessed as inhibition of angiotensin-2-induced aldosterone production after 24 hrs by RIA
In DepthDetails ArticlePubMed