BDBM50444658 CHEMBL3098616
SMILES Cc1ccc(NC(=O)c2ccc(CN3CCN(CCF)CC3)cc2)cc1Nc1nccc(n1)-c1cccnc1
InChI Key InChIKey=IJJBQXDUBAQHKQ-UHFFFAOYSA-N
Data  1 IC50
  Tab Delimited (TSV)   2D SDfile   Computed 3D by Vconf -m prep SDfile
Find this compound or compounds like it in BindingDB:
Activity Spreadsheet -- Enzyme Inhibition Constant Data from BindingDB
Found 1 hit for monomerid = 50444658
TargetBreakpoint cluster region protein/Tyrosine-protein kinase ABL1(Homo sapiens (Human))
The University Of Texas M.D. Anderson Cancer Center
Curated by ChEMBL
LigandPNGBDBM50444658(CHEMBL3098616)
Affinity DataIC50:  1.38E+3nM. Assay description: Inhibition of Bcr-Abl (unknown origin) phosphorylation by spectrophotometric assay
In DepthDetails ArticlePubMed