BDBM50445186 CHEMBL3103202
SMILES COC(=O)[C@@H]1[C@H]2CC[C@@H](C[C@@H]1OC(=O)c1ccccc1)N2CCc1ccc(N=[N+]=[N-])c(I)c1
InChI Key InChIKey=HMYGCPMJWIKMPQ-KVJIRVJXSA-N
Data  1 Kd
  Tab Delimited (TSV)   2D SDfile   Computed 3D by Vconf -m prep SDfile
Find this compound or compounds like it in BindingDB:
Activity Spreadsheet -- Enzyme Inhibition Constant Data from BindingDB
Found 1 hit for monomerid = 50445186
TargetSigma non-opioid intracellular receptor 1(Homo sapiens (Human))
Institut F£R Pharmazeutische Und Medizinische Chemie Der Westf£Lischen Wilhelms-Universit£T M£Nster
Curated by ChEMBL
LigandPNGBDBM50445186(CHEMBL3103202)
Affinity DataKd:  11nM. Assay description: Displacement of [125I]N-IACoc from sigma 1 receptor (unknown origin)
In DepthDetails ArticlePubMed