BDBM50445275 CHEMBL3104003
SMILES CN(C)CCCN1Cc2cc(ccc2C1=O)-c1ccc(\C=C2\NC(=S)NC2=O)s1
InChI Key InChIKey=GVSPPHLDEBXYQU-GZTJUZNOSA-N
Data  1 IC50
  Tab Delimited (TSV)   2D SDfile   Computed 3D by Vconf -m prep SDfile
Find this compound or compounds like it in BindingDB:
Activity Spreadsheet -- Enzyme Inhibition Constant Data from BindingDB
Found 1 hit for monomerid = 50445275
TargetPerforin-1(Homo sapiens (Human))
University Of Auckland
Curated by ChEMBL
LigandPNGBDBM50445275(CHEMBL3104003)
Affinity DataIC50: >2.00E+4nM. Assay description: Inhibition of recombinant perforin (unknown origin)-mediated lysis of human [51Cr]-labelled Jurkat cells assessed as release of [51Cr] preincubated f...
In DepthDetails ArticlePubMed