BDBM50445611 CHEMBL3103988
SMILES N#Cc1cccc(c1)-c1nc(no1)-c1cccnc1
InChI Key InChIKey=HGFXDSQLRSWUBO-UHFFFAOYSA-N
Data  2 EC50
PDB links: 1 PDB ID matches this monomer.
  Tab Delimited (TSV)   2D SDfile   Computed 3D by Vconf -m prep SDfile
Find this compound or compounds like it in BindingDB:
Activity Spreadsheet -- Enzyme Inhibition Constant Data from BindingDB
Found 2 hits for monomerid = 50445611
TargetNeuronal acetylcholine receptor subunit alpha-4/alpha-5/beta-2(Homo sapiens (Human))
The Scripps Research Institute
Curated by ChEMBL
LigandPNGBDBM50445611(CHEMBL3103988)
Affinity DataEC50:  790nM. Assay description: Positive allosteric modulation of human alpha4beta2alpha5 nACHR expressed in HEK-tsA201 cells assessed as potentiation of nicotine-induced current pr...
In DepthDetails ArticlePubMed
TargetNeuronal acetylcholine receptor subunit alpha-4/beta-2(Homo sapiens (Human))
The Scripps Research Institute
Curated by ChEMBL
LigandPNGBDBM50445611(CHEMBL3103988)
Affinity DataEC50:  990nM. Assay description: Positive allosteric modulation of alpha4beta2 nACHR (unknown origin)
In DepthDetails ArticlePubMed