BDBM50445780 CHEMBL3104613
SMILES Cc1nc(sc1C(=O)NCc1ccccc1)-c1cn(Cc2ccccc2)nn1
InChI Key InChIKey=FNRATZPGWXUVAU-UHFFFAOYSA-N
Data  2 IC50
  Tab Delimited (TSV)   2D SDfile   Computed 3D by Vconf -m prep SDfile
Find this compound or compounds like it in BindingDB:
Activity Spreadsheet -- Enzyme Inhibition Constant Data from BindingDB
Found 2 hits for monomerid = 50445780
TargetAcyl-CoA desaturase 1(Mus musculus)
Xenon Pharmaceuticals
Curated by ChEMBL
LigandPNGBDBM50445780(CHEMBL3104613)
Affinity DataIC50:  33nM. Assay description: Inhibition of SCD1 in mouse liver microsomes
In DepthDetails ArticlePubMed
TargetStearoyl-CoA desaturase(Homo sapiens (Human))
Xenon Pharmaceuticals
Curated by ChEMBL
LigandPNGBDBM50445780(CHEMBL3104613)
Affinity DataIC50:  9.98E+3nM. Assay description: Inhibition of SCD1 in human HepG2 cells using [1-14C]stearic acid as substrate
In DepthDetails ArticlePubMed