BDBM50445794 CHEMBL3104819
SMILES Cc1nc(sc1C(=O)NCc1cccnc1)N1CCN(CCCc2ccccc2)C1=O
InChI Key InChIKey=JCRSYWXQXKKIAW-UHFFFAOYSA-N
Data  2 IC50
  Tab Delimited (TSV)   2D SDfile   Computed 3D by Vconf -m prep SDfile
Find this compound or compounds like it in BindingDB:
Activity Spreadsheet -- Enzyme Inhibition Constant Data from BindingDB
Found 2 hits for monomerid = 50445794
TargetStearoyl-CoA desaturase(Homo sapiens (Human))
Xenon Pharmaceuticals
Curated by ChEMBL
LigandPNGBDBM50445794(CHEMBL3104819)
Affinity DataIC50:  8nM. Assay description: Inhibition of SCD1 in human HepG2 cells using [1-14C]stearic acid as substrate
In DepthDetails ArticlePubMed
TargetAcyl-CoA desaturase 1(Mus musculus)
Xenon Pharmaceuticals
Curated by ChEMBL
LigandPNGBDBM50445794(CHEMBL3104819)
Affinity DataIC50:  16nM. Assay description: Inhibition of SCD1 in mouse liver microsomes
In DepthDetails ArticlePubMed