BDBM50446136 CHEMBL3108878
SMILES CC(=O)N1C[C@H](O)C[C@H]1C(=O)NCc1ccc(cc1)-c1cnco1
InChI Key InChIKey=KFYARNZFJDIZMC-CABCVRRESA-N
Data  1 Kd
PDB links: 1 PDB ID matches this monomer.
  Tab Delimited (TSV)   2D SDfile   Computed 3D by Vconf -m prep SDfile
Find this compound or compounds like it in BindingDB:
Activity Spreadsheet -- Enzyme Inhibition Constant Data from BindingDB
Found 1 hit for monomerid = 50446136
Targetvon Hippel-Lindau disease tumor suppressor(Homo sapiens (Human))
University Of Cambridge
Curated by ChEMBL
LigandPNGBDBM50446136(CHEMBL3108878)
Affinity DataKd:  1.50E+5nM. Assay description: Displacement of 19-mer HIF-1alpha peptide from VHL (unknown origin) by isothermal titration calorimetry analysis