BDBM50446232 CHEMBL3109173
SMILES Cc1nnc(CCCCCCCCCCn2cc(COCCOCCOCCOCCOCc3ccc(cc3)C(=O)N3CCC3=O)nn2)n1C1CC2CCC(C1)N2CC[C@H](NC(=O)C1CCC(F)(F)CC1)c1ccccc1
InChI Key InChIKey=JAZHFXVVJSFYRR-GBEGLDLESA-N
Data  1 IC50
  Tab Delimited (TSV)   2D SDfile   Computed 3D by Vconf -m prep SDfile
Find this compound or compounds like it in BindingDB:
Activity Spreadsheet -- Enzyme Inhibition Constant Data from BindingDB
Found 1 hit for monomerid = 50446232
TargetC-C chemokine receptor type 5(Homo sapiens (Human))
The Scripps Research Institute
Curated by ChEMBL
LigandPNGBDBM50446232(CHEMBL3109173)
Affinity DataIC50:  2.60nM. Assay description: Antagonist activity against CCR5 receptor in human TZM-bl cells assessed as inhibition of HIV-1 JR-FL-induced cell-cell fusion between viral envelope...
In DepthDetails ArticlePubMed