BDBM50446346 CHEMBL3109594
SMILES CN1[C@@H](N(C(=O)c2cc(F)ccc12)c1ccccc1)c1ccc(s1)-c1csc(C)n1
InChI Key InChIKey=BRLUZBMXYFCBDS-QFIPXVFZSA-N
Data  1 EC50
  Tab Delimited (TSV)   2D SDfile   Computed 3D by Vconf -m prep SDfile
Find this compound or compounds like it in BindingDB:
Activity Spreadsheet -- Enzyme Inhibition Constant Data from BindingDB
Found 1 hit for monomerid = 50446346
TargetRicin(Ricinus communis)
Cea
Curated by ChEMBL
LigandPNGBDBM50446346(CHEMBL3109594)
Affinity DataEC50:  23nM. Assay description: Inhibition of castor bean ricin-induced toxicity in human A549 cells assessed as protection against toxin-induced inhibition of protein biosynthesis ...
In DepthDetails ArticlePubMed