BDBM50447174 CHEMBL3113129
SMILES CC(C)NC(c1ccc(Cl)cc1)c1ccc(cc1)-c1ncnc2nc[nH]c12
InChI Key InChIKey=ULSOWTDYCOZTGW-UHFFFAOYSA-N
Data  1 IC50
  Tab Delimited (TSV)   2D SDfile   Computed 3D by Vconf -m prep SDfile
Find this compound or compounds like it in BindingDB:
Activity Spreadsheet -- Enzyme Inhibition Constant Data from BindingDB
Found 1 hit for monomerid = 50447174
TargetRAC-alpha serine/threonine-protein kinase(Homo sapiens (Human))
Zhejiang University
Curated by ChEMBL
LigandPNGBDBM50447174(CHEMBL3113129)
Affinity DataIC50:  160nM. Assay description: Inhibition of Akt1 (unknown origin) using ATP/eNOS as substrate preincubated for 5 mins followed by substrate addition measured after 30 mins by fluo...
In DepthDetails ArticlePubMed