BDBM50447467 CHEMBL3115188
SMILES CC(C)c1nc(CN(C)C(=O)N[C@@H](CCNC(C)=O)C(=O)N[C@@H](CC[C@@H](Cc2ccccc2)NC(=O)OCc2cncs2)Cc2ccccc2)cs1
InChI Key InChIKey=KBZPKTMYSVUUNF-JHFJJOSTSA-N
Data  4 IC50
  Tab Delimited (TSV)   2D SDfile   Computed 3D by Vconf -m prep SDfile
Find this compound or compounds like it in BindingDB:
Activity Spreadsheet -- Enzyme Inhibition Constant Data from BindingDB
Found 4 hits for monomerid = 50447467
TargetCytochrome P450 2C19(Homo sapiens (Human))
Gilead Sciences
Curated by ChEMBL
LigandPNGBDBM50447467(CHEMBL3115188)
Affinity DataIC50: >2.50E+4nM. Assay description: Inhibition of human CYP2C19
In DepthDetails ArticlePubMed
TargetCytochrome P450 2C9(Homo sapiens (Human))
Gilead Sciences
Curated by ChEMBL
LigandPNGBDBM50447467(CHEMBL3115188)
Affinity DataIC50:  1.55E+4nM. Assay description: Inhibition of human CYP2C9
In DepthDetails ArticlePubMed
TargetCytochrome P450 2D6(Homo sapiens (Human))
Gilead Sciences
Curated by ChEMBL
LigandPNGBDBM50447467(CHEMBL3115188)
Affinity DataIC50:  800nM. Assay description: Inhibition of human CYP2D6
In DepthDetails ArticlePubMed
TargetCytochrome P450 1A2(Homo sapiens (Human))
Gilead Sciences
Curated by ChEMBL
LigandPNGBDBM50447467(CHEMBL3115188)
Affinity DataIC50: >2.50E+4nM. Assay description: Inhibition of human CYP1A2
In DepthDetails ArticlePubMed