BDBM50447569 CHEMBL3112697
SMILES Cc1ccoc1C(=O)Nc1cccnc1
InChI Key InChIKey=AOGLTGFTIMRCNZ-UHFFFAOYSA-N
Data  1 IC50  1 Kd
  Tab Delimited (TSV)   2D SDfile   Computed 3D by Vconf -m prep SDfile
Find this compound or compounds like it in BindingDB:
Activity Spreadsheet -- Enzyme Inhibition Constant Data from BindingDB
Found 2 hits for monomerid = 50447569
TargetNicotinamide phosphoribosyltransferase(Homo sapiens (Human))
Genentech
Curated by ChEMBL
LigandPNGBDBM50447569(CHEMBL3112697)
Affinity DataIC50: >1.00E+5nM. Assay description: Inhibition of full length C-terminal His6-tagged human NAMPT expressed in Escherichia coli Rosetta (DE3) cells using PRPP/NAM as substrate/cofactor p...
In DepthDetails ArticlePubMed
TargetNicotinamide phosphoribosyltransferase(Homo sapiens (Human))
Genentech
Curated by ChEMBL
LigandPNGBDBM50447569(CHEMBL3112697)
Affinity DataKd:  1.30E+4nM. Assay description: Binding affinity to N-terminal His6-tagged/biotinylated C-terminal Avi-tagged human NAMPT (2 to 491) by SPR analysis
In DepthDetails ArticlePubMed