BDBM50447910 CHEMBL3114969
SMILES Cn1cnc(c1)S(=O)(=O)N1C[C@H]2[C@@H](C1)[C@]2(CNC(=O)c1ccc(Cl)cc1Cl)CC1CC1
InChI Key InChIKey=RBWUPOKAZDJRDM-UPHUGPLXSA-N
Data  1 IC50
  Tab Delimited (TSV)   2D SDfile   Computed 3D by Vconf -m prep SDfile
Find this compound or compounds like it in BindingDB:
Activity Spreadsheet -- Enzyme Inhibition Constant Data from BindingDB
Found 1 hit for monomerid = 50447910
TargetSodium- and chloride-dependent glycine transporter 1(Homo sapiens (Human))
Vanderbilt University Medical Center
Curated by ChEMBL
LigandPNGBDBM50447910(CHEMBL3114969)
Affinity DataIC50:  4nM. Assay description: Inhibition of GlyT1 (unknown origin) assessed as inhibition of [14C]glycine uptake
In DepthDetails ArticlePubMed