BDBM50448033 CHEMBL3115237
SMILES CCCc1c(Cc2ccc(cc2)-c2ccccc2C(O)=O)c2ccc(cc2n1C)C(=O)NC(CC)c1ccccc1
InChI Key InChIKey=KEDCDYJNIWOZOY-UHFFFAOYSA-N
Data  2 EC50
  Tab Delimited (TSV)   2D SDfile   Computed 3D by Vconf -m prep SDfile
Find this compound or compounds like it in BindingDB:
Activity Spreadsheet -- Enzyme Inhibition Constant Data from BindingDB
Found 2 hits for monomerid = 50448033
TargetPeroxisome proliferator-activated receptor gamma(Mus musculus)
Glaxosmithkline
Curated by ChEMBL
LigandPNGBDBM50448033(CHEMBL3115237)
Affinity DataEC50:  3nM. Assay description: Agonist activity at mouse PPARgamma expressed in CV-1 cells by reporter gene assay
In DepthDetails ArticlePubMed
TargetPeroxisome proliferator-activated receptor alpha(Mus musculus)
Glaxosmithkline
Curated by ChEMBL
LigandPNGBDBM50448033(CHEMBL3115237)
Affinity DataEC50:  170nM. Assay description: Agonist activity at mouse PPARalpha expressed in CV-1 cells by reporter gene assay
In DepthDetails ArticlePubMed