BDBM50448373 CHEMBL3121477
SMILES [Br-].[Br-].C[N+](C)(CCCCCC[N+]1(C)CCC(CC1)N1C(=O)c2ccccc2C1=O)CC#CCOC1=NOCC1
InChI Key InChIKey=VSVJLOGYLZVLIF-UHFFFAOYSA-L
Data  2 EC50
  Tab Delimited (TSV)   2D SDfile   Computed 3D by Vconf -m prep SDfile
Find this compound or compounds like it in BindingDB:
Activity Spreadsheet -- Enzyme Inhibition Constant Data from BindingDB
Found 2 hits for monomerid = 50448373
TargetMuscarinic acetylcholine receptor M2(GUINEA PIG)
Universit£
Curated by ChEMBL
LigandPNGBDBM50448373(CHEMBL3121477)
Affinity DataEC50:  38nM. Assay description: Agonist activity at muscarinic M2 receptor in albino guinea pig left atrium assessed as stimulation of electrically-induced response
In DepthDetails ArticlePubMed
TargetMuscarinic acetylcholine receptor M2(GUINEA PIG)
Universit£
Curated by ChEMBL
LigandPNGBDBM50448373(CHEMBL3121477)
Affinity DataEC50:  69nM. Assay description: Agonist activity at muscarinic M3 receptor in albino guinea pig ileum assessed as stimulation of electrically-induced response
In DepthDetails ArticlePubMed