BDBM50448738 CHEMBL3127909
SMILES COc1cc2nc(-c3ccco3)n(-c3cc4nc(N)nc(N)c4cc3Cl)c2cc1OC
InChI Key InChIKey=BRWUKGGEWWXVMJ-UHFFFAOYSA-N
Data  2 KI
  Tab Delimited (TSV)   2D SDfile   Computed 3D by Vconf -m prep SDfile
Find this compound or compounds like it in BindingDB:
Activity Spreadsheet -- Enzyme Inhibition Constant Data from BindingDB
Found 2 hits for monomerid = 50448738
TargetDihydrofolate reductase(Staphylococcus aureus)
Trius Therapeutics
Curated by ChEMBL
LigandPNGBDBM50448738(CHEMBL3127909)
Affinity DataKi:  0.0240nM. Assay description: Inhibition of Staphylococcus aureus DHFR using dihydrofolate as substrate preincubated for 10 mins followed by substrate addition by spectrophotometr...
In DepthDetails ArticlePubMed
TargetDihydrofolate reductase(Homo sapiens (Human))
Trius Therapeutics
Curated by ChEMBL
LigandPNGBDBM50448738(CHEMBL3127909)
Affinity DataKi:  610nM. Assay description: Inhibition of human DHFR using dihydrofolate as substrate preincubated for 10 mins followed by substrate addition by spectrophotometric analysis in p...
In DepthDetails ArticlePubMed