BDBM50448832 CHEMBL3125049
SMILES CCN(CCc1cccc(F)c1)Cc1cccc(c1)N=C(N)c1cccs1
InChI Key InChIKey=DFFRHUPAEPPGQC-UHFFFAOYSA-N
Data  3 KI
  Tab Delimited (TSV)   2D SDfile   Computed 3D by Vconf -m prep SDfile
Find this compound or compounds like it in BindingDB:
Activity Spreadsheet -- Enzyme Inhibition Constant Data from BindingDB
Found 3 hits for monomerid = 50448832
TargetNitric oxide synthase, brain(Rattus norvegicus (rat))
Northwestern University
Curated by ChEMBL
LigandPNGBDBM50448832(CHEMBL3125049)
Affinity DataKi:  73nM. Assay description: Inhibition of recombinant rat nNOS overexpressed in Escherichia coli using L-arginine as substrate assessed as nitric oxide formation measured for 60...
In DepthDetails ArticlePubMed
TargetNitric oxide synthase, inducible(Mus musculus (mouse))
Northwestern University
Curated by ChEMBL
LigandPNGBDBM50448832(CHEMBL3125049)
Affinity DataKi:  1.21E+4nM. Assay description: Inhibition of recombinant mouse iNOS overexpressed in Escherichia coli using L-arginine as substrate assessed as nitric oxide formation measured for ...
In DepthDetails ArticlePubMed
TargetNitric oxide synthase, endothelial(Bos taurus (bovine))
Northwestern University
Curated by ChEMBL
LigandPNGBDBM50448832(CHEMBL3125049)
Affinity DataKi:  2.17E+4nM. Assay description: Inhibition of recombinant bovine eNOS overexpressed in Escherichia coli using L-arginine as substrate assessed as nitric oxide formation measured for...
In DepthDetails ArticlePubMed