BDBM50448908 CHEMBL3125300
SMILES O=C(CCCCCCc1ccccc1)c1ncc(o1)-c1ccc(cn1)C#N
InChI Key InChIKey=GGZCPVHSUQCUBJ-UHFFFAOYSA-N
Data  3 KI
  Tab Delimited (TSV)   2D SDfile   Computed 3D by Vconf -m prep SDfile
Find this compound or compounds like it in BindingDB:
Activity Spreadsheet -- Enzyme Inhibition Constant Data from BindingDB
Found 3 hits for monomerid = 50448908
TargetFatty-acid amide hydrolase 1 [30-579](Rattus norvegicus (rat))
The Scripps Research Institute
Curated by ChEMBL
LigandPNGBDBM50448908(CHEMBL3125300)
Affinity DataKi:  9.90nM. Assay description: Inhibition of recombinant rat FAAH expressed in Escherichia coli assessed as breakdown of [14C]-oleamide by Dixon plot analysis
In DepthDetails ArticlePubMed
TargetFatty-acid amide hydrolase 1 [30-579](Rattus norvegicus (rat))
The Scripps Research Institute
Curated by ChEMBL
LigandPNGBDBM50448908(CHEMBL3125300)
Affinity DataKi:  11nM. Assay description: Time-dependent inhibition of recombinant rat FAAH expressed in Escherichia coli assessed as breakdown of [14C]-oleamide preincubated for 1 hr by Dixo...
In DepthDetails ArticlePubMed
TargetFatty-acid amide hydrolase 1 [30-579](Rattus norvegicus (rat))
The Scripps Research Institute
Curated by ChEMBL
LigandPNGBDBM50448908(CHEMBL3125300)
Affinity DataKi:  14nM. Assay description: Time-dependent inhibition of recombinant rat FAAH expressed in Escherichia coli assessed as breakdown of [14C]-oleamide preincubated for 3 hrs by Dix...
In DepthDetails ArticlePubMed