BDBM50448945 CHEMBL3125521::US9296736, 381::US9593129, Example 381
SMILES C[C@]1(CC(O)=O)C[C@@H]([C@H](N([C@H](CS(=O)(=O)N2CCCC2)C2CC2)C1=O)c1ccc(Cl)cc1)c1cccc(Cl)c1
InChI Key InChIKey=JHVUPAFRBHMUAB-GCMXZSHTSA-N
Data  3 IC50
PDB links: 1 PDB ID matches this monomer.
  Tab Delimited (TSV)   2D SDfile   Computed 3D by Vconf -m prep SDfile
Find this compound or compounds like it in BindingDB:
Activity Spreadsheet -- Enzyme Inhibition Constant Data from BindingDB
Found 3 hits for monomerid = 50448945
LigandPNGBDBM50448945(CHEMBL3125521 | US9296736, 381 | US9593129, Exampl...)
Affinity DataIC50:  0.100nMpH: 7.4 T: 2°C. Assay description: The standard assay conditions for the in vitro HTRF assay consisted of a 50 ul total reaction volume in black 384-well Costar polypropylene plates in...
TargetE3 ubiquitin-protein ligase Mdm2 [1-188](Homo sapiens (Human))
Amgen
US Patent
LigandPNGBDBM50448945(CHEMBL3125521 | US9296736, 381 | US9593129, Exampl...)
Affinity DataIC50:  0.100nM. Assay description: The standard assay conditions for the in vitro HTRF assay consisted of a 50 ul total reaction volume in black 384-well Costar polypropylene plates in...
TargetE3 ubiquitin-protein ligase Mdm2(Homo sapiens (Human))
Amgen
Curated by ChEMBL
LigandPNGBDBM50448945(CHEMBL3125521 | US9296736, 381 | US9593129, Exampl...)
Affinity DataIC50:  0.100nM. Assay description: Binding affinity to human GST-thrombin-tagged MDM2 assessed as inhibition of interaction with human p53 after 1 hr by HTRF assay