BDBM50448982 CHEMBL3125728
SMILES COc1ccc(cc1)-c1nc2ncc(cc2[nH]1)-c1csc(c1)C(=O)NCCC(C)C
InChI Key InChIKey=TVWMRPWVPSKLOP-UHFFFAOYSA-N
Data  5 IC50
  Tab Delimited (TSV)   2D SDfile   Computed 3D by Vconf -m prep SDfile
Find this compound or compounds like it in BindingDB:
Activity Spreadsheet -- Enzyme Inhibition Constant Data from BindingDB
Found 5 hits for monomerid = 50448982
TargetCyclin-dependent kinase 2(Homo sapiens (Human))
Astrazeneca
Curated by ChEMBL
LigandPNGBDBM50448982(CHEMBL3125728)
Affinity DataIC50: >3.00E+4nM. Assay description: Inhibition of CDK2 (unknown origin)
In DepthDetails ArticlePubMed
TargetInhibitor of nuclear factor kappa-B kinase subunit epsilon(Homo sapiens (Human))
Astrazeneca
Curated by ChEMBL
LigandPNGBDBM50448982(CHEMBL3125728)
Affinity DataIC50:  1.75E+3nM. Assay description: Inhibition of IKK-epsilon (unknown origin) using 5FAM-AKELDQGSLCTpSFVGTLQ-NH2 as substrate by microfluidic mobility shift assay
In DepthDetails ArticlePubMed
TargetAurora kinase B(Homo sapiens (Human))
Astrazeneca
Curated by ChEMBL
LigandPNGBDBM50448982(CHEMBL3125728)
Affinity DataIC50:  1.88E+4nM. Assay description: Inhibition of aurora B (unknown origin)
In DepthDetails ArticlePubMed
TargetSerine/threonine-protein kinase TBK1(Homo sapiens (Human))
Astrazeneca
Curated by ChEMBL
LigandPNGBDBM50448982(CHEMBL3125728)
Affinity DataIC50:  78nM. Assay description: Inhibition of TBK1 in HEK293 cells after 4.5 hrs by ISRE-luciferase reporter gene assay in presence of poly I:C
In DepthDetails ArticlePubMed
TargetSerine/threonine-protein kinase TBK1(Homo sapiens (Human))
Astrazeneca
Curated by ChEMBL
LigandPNGBDBM50448982(CHEMBL3125728)
Affinity DataIC50:  143nM. Assay description: Inhibition of recombinant full-length TBK1 (unknown origin) using CK1tide as substrate by microfluidic mobility shift assay
In DepthDetails ArticlePubMed