BDBM50449101 CHEMBL3127130
SMILES CC(C)COc1ccc(cc1C#N)-c1nc(N)[nH]c(=O)c1C#N
InChI Key InChIKey=JCEKKTBKLGCDMM-UHFFFAOYSA-N
Data  1 IC50
  Tab Delimited (TSV)   2D SDfile   Computed 3D by Vconf -m prep SDfile
Find this compound or compounds like it in BindingDB:
Activity Spreadsheet -- Enzyme Inhibition Constant Data from BindingDB
Found 1 hit for monomerid = 50449101
TargetXanthine dehydrogenase/oxidase(Homo sapiens (Human))
Astrazeneca
Curated by ChEMBL
LigandPNGBDBM50449101(CHEMBL3127130)
Affinity DataIC50:  0.501nM. Assay description: Competitive reversible inhibition of C-terminally FLAG-tagged human xanthine oxidase (amino acid 1 to 1333) expressed in baculovirus system after 15 ...
In DepthDetails ArticlePubMed