BDBM50449103 CHEMBL3127140
SMILES FC(F)(F)c1cccc(c1)-c1cn2c(cc[nH]c2=O)n1
InChI Key InChIKey=NAWZOPMRGPVZTA-UHFFFAOYSA-N
Data  1 IC50
  Tab Delimited (TSV)   2D SDfile   Computed 3D by Vconf -m prep SDfile
Find this compound or compounds like it in BindingDB:
Activity Spreadsheet -- Enzyme Inhibition Constant Data from BindingDB
Found 1 hit for monomerid = 50449103
TargetXanthine dehydrogenase/oxidase(Bos taurus (Bovine))
Astrazeneca
Curated by ChEMBL
LigandPNGBDBM50449103(CHEMBL3127140)
Affinity DataIC50:  398nM. Assay description: Competitive inhibition of bovine xanthine oxidase
In DepthDetails ArticlePubMed