BDBM50449123 CHEMBL432733
SMILES Cc1c(nc(N)[nH]c1=O)-c1ccccc1
InChI Key InChIKey=RTJLTGPOGBPZFC-UHFFFAOYSA-N
Data  1 IC50
  Tab Delimited (TSV)   2D SDfile   Computed 3D by Vconf -m prep SDfile
Find this compound or compounds like it in BindingDB:
Activity Spreadsheet -- Enzyme Inhibition Constant Data from BindingDB
Found 1 hit for monomerid = 50449123
TargetXanthine dehydrogenase/oxidase(Homo sapiens (Human))
Astrazeneca
Curated by ChEMBL
LigandPNGBDBM50449123(CHEMBL432733)
Affinity DataIC50:  2.51E+4nM. Assay description: Inhibition of C-terminally FLAG-tagged human xanthine oxidase (amino acid 1 to 1333) expressed in baculovirus system after 15 mins by spectrophotomet...
In DepthDetails ArticlePubMed