BDBM50449132 CHEMBL3127142
SMILES CNc1nc(cc(=O)[nH]1)-c1ccccc1
InChI Key InChIKey=FCLQUHFGSJNESE-UHFFFAOYSA-N
Data  1 IC50
  Tab Delimited (TSV)   2D SDfile   Computed 3D by Vconf -m prep SDfile
Find this compound or compounds like it in BindingDB:
Activity Spreadsheet -- Enzyme Inhibition Constant Data from BindingDB
Found 1 hit for monomerid = 50449132
TargetXanthine dehydrogenase/oxidase(Homo sapiens (Human))
Astrazeneca
Curated by ChEMBL
LigandPNGBDBM50449132(CHEMBL3127142)
Affinity DataIC50:  7.94E+3nM. Assay description: Inhibition of C-terminally FLAG-tagged human xanthine oxidase (amino acid 1 to 1333) expressed in baculovirus system after 15 mins by spectrophotomet...
In DepthDetails ArticlePubMed