BDBM50449326 CHEMBL3126040
SMILES Fc1cc(F)cc(c1)-c1cnc(NC(=O)[C@@H]2CC[C@@H](CC2)N2CCCC2=O)cn1
InChI Key InChIKey=OFLQLZVOIWKDDT-XFHMXUHZSA-N
Data  1 KI
  Tab Delimited (TSV)   2D SDfile   Computed 3D by Vconf -m prep SDfile
Find this compound or compounds like it in BindingDB:
Activity Spreadsheet -- Enzyme Inhibition Constant Data from BindingDB
Found 1 hit for monomerid = 50449326
TargetNeuropeptide Y receptor type 5(Homo sapiens (Human))
Lundbeck Research Usa
Curated by ChEMBL
LigandPNGBDBM50449326(CHEMBL3126040)
Affinity DataKi:  6nM. Assay description: Displacement of [125I]PYY from human NPY5 receptor transfected in LM(tk-) cell membranes after 120 mins by solid scintillation counting
In DepthDetails ArticlePubMed