BDBM50449396 CHEMBL3127040
SMILES COc1ccc2c(c1)oc1cccc(CNC(C)C)c21
InChI Key InChIKey=IGFHLBTUVSKECP-UHFFFAOYSA-N
Data  2 IC50
  Tab Delimited (TSV)   2D SDfile   Computed 3D by Vconf -m prep SDfile
Find this compound or compounds like it in BindingDB:
Activity Spreadsheet -- Enzyme Inhibition Constant Data from BindingDB
Found 2 hits for monomerid = 50449396
TargetCholinesterase(Equus caballus (Horse))
Southeast University
Curated by ChEMBL
LigandPNGBDBM50449396(CHEMBL3127040)
Affinity DataIC50:  1.35E+4nM. Assay description: Inhibition of equine serum BChE using butyrylthiocholine iodide as substrate preincubated for 5 mins followed by substrate addition measured after 5 ...
In DepthDetails ArticlePubMed
TargetAcetylcholinesterase(Electrophorus electricus (Electric eel))
Southeast University
Curated by ChEMBL
LigandPNGBDBM50449396(CHEMBL3127040)
Affinity DataIC50:  1.16E+4nM. Assay description: Inhibition of electric eel AChE using acetylthiocholine iodide as substrate preincubated for 5 mins followed by substrate addition measured after 5 m...
In DepthDetails ArticlePubMed