BDBM50449570 CHEMBL2448137
SMILES COc1cc(N)c(Cl)cc1C(=O)N[C@H]1C2CC3CN(CC13)C2
InChI Key InChIKey=MRKYTIJPEALHEE-DTEJIXJUSA-N
Data  1 KI  1 EC50
  Tab Delimited (TSV)   2D SDfile   Computed 3D by Vconf -m prep SDfile
Find this compound or compounds like it in BindingDB:
Activity Spreadsheet -- Enzyme Inhibition Constant Data from BindingDB
Found 2 hits for monomerid = 50449570
Target5-hydroxytryptamine receptor 3A(RAT)
TBA
Curated by ChEMBL
LigandPNGBDBM50449570(CHEMBL2448137)
Affinity DataKi:  3.90nM. Assay description: Compound was evaluated in vivo for the antagonistic activity towards 5-hydroxytryptamine 3 receptor
In DepthDetails Article
Target5-hydroxytryptamine receptor 4(RAT)
TBA
Curated by ChEMBL
LigandPNGBDBM50449570(CHEMBL2448137)
Affinity DataEC50:  3.87E+3nM. Assay description: Compound was evaluated for the agonistic activity towards 5-hydroxytryptamine 4 receptor using the rat tunica muscularis mucosae (TMM) esophagus stri...
In DepthDetails Article