BDBM50449911 CHEMBL2079770
SMILES [K+].CCCCc1nc(Cl)c(C(=O)Oc2ccc3CCCc3c2)n1Cc1cccc2n(ccc12)-c1ccccc1-c1nn[n-]n1
InChI Key InChIKey=WAPZBKPVSXBSLV-UHFFFAOYSA-N
Data  1 KI
  Tab Delimited (TSV)   2D SDfile   Computed 3D by Vconf -m prep SDfile
Find this compound or compounds like it in BindingDB:
Activity Spreadsheet -- Enzyme Inhibition Constant Data from BindingDB
Found 1 hit for monomerid = 50449911
LigandPNGBDBM50449911(CHEMBL2079770)
Affinity DataKi:  39nM. Assay description: Binding affinity for Angiotensin II receptor, type 1 determined using [125I]- labeled [Sar1,Ile8] angiotensin II in rat adrenocortical membranes
In DepthDetails Article