BDBM50449918 BMS-181688::CHEMBL2021416
SMILES [K+].CCCCc1nc(Cl)c(C(=O)OCC)n1Cc1cccc2n(ccc12)-c1ccccc1-c1nn[n-]n1
InChI Key InChIKey=ZAGYHJYDLBVEMP-UHFFFAOYSA-N
Data  1 KI
  Tab Delimited (TSV)   2D SDfile   Computed 3D by Vconf -m prep SDfile
Find this compound or compounds like it in BindingDB:
Activity Spreadsheet -- Enzyme Inhibition Constant Data from BindingDB
Found 1 hit for monomerid = 50449918
LigandPNGBDBM50449918(BMS-181688 | CHEMBL2021416)
Affinity DataKi:  25nM. Assay description: Binding affinity for Angiotensin II receptor, type 1 determined using [125I]- labeled [Sar1,Ile8] angiotensin II in rat adrenocortical membranes
In DepthDetails Article