BDBM50450169 CHEMBL308341
SMILES CN1CC[C@H](CO)[C@H]1c1cc(C)no1
InChI Key InChIKey=QSHYKMIHTHFQLQ-SCZZXKLOSA-N
Data  1 KI
  Tab Delimited (TSV)   2D SDfile   Computed 3D by Vconf -m prep SDfile
Find this compound or compounds like it in BindingDB:
Activity Spreadsheet -- Enzyme Inhibition Constant Data from BindingDB
Found 1 hit for monomerid = 50450169
LigandPNGBDBM50450169(CHEMBL308341)
Affinity DataKi: >1.00E+4nM. Assay description: Binding affinity for Nicotinic acetylcholine receptor alpha4-beta2 by displacement of [3H](-)-cytisine from whole rat brain membranes
In DepthDetails Article