BDBM50450172 CHEMBL4162505
SMILES [H][C@]12[#6]-[#6]-[#6](=[#6])-[#6@@H](-[#6]\[#6]=[#6]-3/[#6@@H](-[#6]-[#8]-[#6]-3=O)-[#8][Si;v4]([#6])([#6])C([#6])([#6])[#6])[C@]1([#6])[#6]-[#6]-[#6](=O)[C@@]2([#6])[#6]-[#8]
InChI Key InChIKey=SCAKGIWGQUBTJI-XBRGCQBRSA-N
Data  5 EC50
  Tab Delimited (TSV)   2D SDfile   Computed 3D by Vconf -m prep SDfile
Find this compound or compounds like it in BindingDB:
Activity Spreadsheet -- Enzyme Inhibition Constant Data from BindingDB
Found 5 hits for monomerid = 50450172
TargetSignal transducer and activator of transcription 3(Homo sapiens (Human))
University Of Macau
Curated by ChEMBL
LigandPNGBDBM50450172(CHEMBL4162505)
Affinity DataEC50: >1.00E+4nM. Assay description: Inhibition of NF-kappaB stimulated STAT3 activation in human HeLa cells incubated with NF-kappaB for 16 hrs followed by compound addition measured af...
Ligand InfoPC cidPC sid
In DepthDetails ArticlePubMed
TargetSignal transducer and activator of transcription 3(Homo sapiens (Human))
University Of Macau
Curated by ChEMBL
LigandPNGBDBM50450172(CHEMBL4162505)
Affinity DataEC50: >1.00E+4nM. Assay description: Inhibition of IFNgamma-stimulated STAT3 activation in human HeLa cells incubated with IFNgamma for 16 hrs followed by compound addition measured afte...
Ligand InfoPC cidPC sid
In DepthDetails ArticlePubMed
TargetSignal transducer and activator of transcription 3(Homo sapiens (Human))
University Of Macau
Curated by ChEMBL
LigandPNGBDBM50450172(CHEMBL4162505)
Affinity DataEC50: >1.00E+4nM. Assay description: Inhibition of NF-kappaB stimulated STAT3 activation in human AD293 cells incubated with NF-kappaB for 16 hrs followed by compound addition measured a...
Ligand InfoPC cidPC sid
In DepthDetails ArticlePubMed
TargetSignal transducer and activator of transcription 3(Homo sapiens (Human))
University Of Macau
Curated by ChEMBL
LigandPNGBDBM50450172(CHEMBL4162505)
Affinity DataEC50: >1.00E+4nM. Assay description: Inhibition of IL-6 stimulated STAT3 activation in human AD293 cells incubated with IL-6 for 16 hrs followed by compound addition measured after 6 hrs...
Ligand InfoPC cidPC sid
In DepthDetails ArticlePubMed
TargetSignal transducer and activator of transcription 3(Homo sapiens (Human))
University Of Macau
Curated by ChEMBL
LigandPNGBDBM50450172(CHEMBL4162505)
Affinity DataEC50: >1.00E+4nM. Assay description: Inhibition of IFNgamma-stimulated STAT3 activation in human AD293 cells incubated with IFNgamma for 16 hrs followed by compound addition measured aft...
Ligand InfoPC cidPC sid
In DepthDetails ArticlePubMed