BDBM50450333 CHEMBL48094
SMILES CCCCCCN(CCCCCSc1nc2c[nH]cnc2n1)C(=O)Nc1ccc(F)cc1F
InChI Key InChIKey=XRFFUVDSPMTLHB-UHFFFAOYSA-N
Data  1 IC50
  Tab Delimited (TSV)   2D SDfile   Computed 3D by Vconf -m prep SDfile
Find this compound or compounds like it in BindingDB:
Activity Spreadsheet -- Enzyme Inhibition Constant Data from BindingDB
Found 1 hit for monomerid = 50450333
TargetSterol O-acyltransferase 1(Rattus norvegicus)
Dupont Pharmaceuticals
Curated by ChEMBL
LigandPNGBDBM50450333(CHEMBL48094)
Affinity DataIC50:  860nM. Assay description: In vitro inhibition of acyl coenzyme A:cholesterol acyltransferase (ACAT) in rat hepatic microsomes by using AIV assay.
In DepthDetails