BDBM50450734 CHEMBL318869
SMILES Clc1ncc(OC[C@@H]2CCN2)cc1-c1ccccc1
InChI Key InChIKey=MIFUJSMJGQPPSC-LBPRGKRZSA-N
Data  1 KI
  Tab Delimited (TSV)   2D SDfile   Computed 3D by Vconf -m prep SDfile
Find this compound or compounds like it in BindingDB:
Activity Spreadsheet -- Enzyme Inhibition Constant Data from BindingDB
Found 1 hit for monomerid = 50450734
TargetNeuronal acetylcholine receptor subunit alpha-4/beta-2(Rattus norvegicus (Rat))
Abbott Laboratories
Curated by ChEMBL
LigandPNGBDBM50450734(CHEMBL318869)
Affinity DataKi:  0.0220nM. Assay description: Binding affinity towards Nicotinic acetylcholine receptor alpha4-beta2 in rat brain using [3H]-cytisine as radioligand
In DepthDetails ArticlePubMed