BDBM50450746 CHEMBL441069
SMILES Cc1ncccc1OC[C@@H]1CCN1
InChI Key InChIKey=JJOYHYAHTVBNEQ-VIFPVBQESA-N
Data  1 KI
  Tab Delimited (TSV)   2D SDfile   Computed 3D by Vconf -m prep SDfile
Find this compound or compounds like it in BindingDB:
Activity Spreadsheet -- Enzyme Inhibition Constant Data from BindingDB
Found 1 hit for monomerid = 50450746
TargetNeuronal acetylcholine receptor subunit alpha-4/beta-2(Rattus norvegicus (Rat))
Abbott Laboratories
Curated by ChEMBL
LigandPNGBDBM50450746(CHEMBL441069)
Affinity DataKi:  1.40nM. Assay description: Binding affinity towards Nicotinic acetylcholine receptor alpha4-beta2 in rat brain using [3H]-cytisine as radioligand
In DepthDetails ArticlePubMed