BDBM50450974 CHEMBL4206040
SMILES OB(O)CNC(=O)S(=O)(=O)c1cc(Cl)cc(c1)-c1nnn[nH]1
InChI Key InChIKey=DBGVEPOPIFWWLP-UHFFFAOYSA-N
Data  1 KI
  Tab Delimited (TSV)   2D SDfile   Computed 3D by Vconf -m prep SDfile
Find this compound or compounds like it in BindingDB:
Activity Spreadsheet -- Enzyme Inhibition Constant Data from BindingDB
Found 1 hit for monomerid = 50450974
TargetBeta-lactamase 1(Bacillus cereus)
Universidade De Santiago De Compostela
Curated by ChEMBL
LigandPNGBDBM50450974(CHEMBL4206040)
Affinity DataKi:  0.200nM. Assay description: Inhibition of Bacillus cereus beta-lactamase AmpC using CENTA as substrate up to 30 mins by Lineweaver-Burk plot analysis
Ligand InfoPC cidPC sid
In DepthDetails ArticlePubMed