BDBM50450981 CHEMBL4215829
SMILES C[C@H](C(=O)NCc1cc(nn1-c1ccc(F)c(Cl)c1)C(C)(C)C)c1ccc(NS(C)(=O)=O)c(F)c1
InChI Key InChIKey=UDDMRDVWFRNVPI-AWEZNQCLSA-N
Data  1 KI
  Tab Delimited (TSV)   2D SDfile   Computed 3D by Vconf -m prep SDfile
Find this compound or compounds like it in BindingDB:
Activity Spreadsheet -- Enzyme Inhibition Constant Data from BindingDB
Found 1 hit for monomerid = 50450981
TargetTransient receptor potential cation channel subfamily V member 1(Homo sapiens (Human))
Seoul National University
Curated by ChEMBL
LigandPNGBDBM50450981(CHEMBL4215829)
Affinity DataKi:  0.100nM. Assay description: Antagonist activity at human TRPV1 expressed in CHO cells assessed as inhibition of capsaicin-induced intracellular calcium level preincubated for 6 ...
Ligand InfoPC cidPC sid
In DepthDetails ArticlePubMed