BDBM50451146 CHEMBL3137856
SMILES [H][C@@]12CCC(=O)[C@@]1(C)CC[C@@]1([H])[C@@]2([H])CCC2C[C@@](O)(CCCCCC)CC[C@]12C
InChI Key InChIKey=SUFKNLCDOHRDMW-VOTDOTPFSA-N
Data  1 IC50
  Tab Delimited (TSV)   2D SDfile   Computed 3D by Vconf -m prep SDfile
Find this compound or compounds like it in BindingDB:
Activity Spreadsheet -- Enzyme Inhibition Constant Data from BindingDB
Found 1 hit for monomerid = 50451146
Target17-beta-hydroxysteroid dehydrogenase type 3(Homo sapiens (Human))
Laval University
Curated by ChEMBL
LigandPNGBDBM50451146(CHEMBL3137856)
Affinity DataIC50:  100nM. Assay description: Inhibitory concentration against type-3 17-beta-HSD expressed in HEK293 cells
In DepthDetails ArticlePubMed