BDBM50451205 CHEMBL293426
SMILES CC(C)(C)OC(=O)N[C@@H](CC(=O)OC1CCCC1)C(=O)OCc1ccc(Cl)cc1
InChI Key InChIKey=ZVKHDNBOVQSMTO-KRWDZBQOSA-N
Data  1 IC50
  Tab Delimited (TSV)   2D SDfile   Computed 3D by Vconf -m prep SDfile
Find this compound or compounds like it in BindingDB:
Activity Spreadsheet -- Enzyme Inhibition Constant Data from BindingDB
Found 1 hit for monomerid = 50451205
TargetVoltage-dependent N-type calcium channel subunit alpha-1B(Homo sapiens (Human))
No Pharmaceutical
Curated by ChEMBL
LigandPNGBDBM50451205(CHEMBL293426)
Affinity DataIC50:  3.30E+3nM. Assay description: In vitro inhibition against N-type calcium influx in IMR-32 cells
In DepthDetails ArticlePubMed