BDBM50451355 CHEMBL4214938
SMILES Oc1cccc(\C=N\c2ccc(OCc3ccccc3)cc2)c1O
InChI Key InChIKey=IDYWNAZGCWLRCV-FYJGNVAPSA-N
Data  2 IC50
  Tab Delimited (TSV)   2D SDfile   Computed 3D by Vconf -m prep SDfile
Find this compound or compounds like it in BindingDB:
Activity Spreadsheet -- Enzyme Inhibition Constant Data from BindingDB
Found 2 hits for monomerid = 50451355
TargetAmine oxidase [flavin-containing] B(Homo sapiens (Human))
Shenyang Pharmaceutical University
Curated by ChEMBL
LigandPNGBDBM50451355(CHEMBL4214938)
Affinity DataIC50:  6.87E+3nM. Assay description: Inhibition of human MAO-B using p-tyramine as substrate preincubated for 15 mins followed by substrate addition measured after 20 mins by fluorescenc...
Ligand InfoPC cidPC sid
In DepthDetails ArticlePubMed
TargetAmine oxidase [flavin-containing] A(Homo sapiens (Human))
Shenyang Pharmaceutical University
Curated by ChEMBL
LigandPNGBDBM50451355(CHEMBL4214938)
Affinity DataIC50:  1.14E+4nM. Assay description: Inhibition of human MAO-A using p-tyramine as substrate preincubated for 15 mins followed by substrate addition measured after 20 mins by fluorescenc...
Ligand InfoPC cidPC sid
In DepthDetails ArticlePubMed