BDBM50451375 CHEMBL3138387
SMILES [H][C@@]1(CC[C@@]2([H])[C@]3([H])[C@H](O)C[C@]4([H])C[C@H](O)CC[C@]4(C)[C@@]3([H])CC[C@]12C)[C@H](C)CCC(=O)\N=c1/sc(nn1C)S(N)(=O)=O
InChI Key InChIKey=RKOMXGLUQRAPQU-ABQBCBDNSA-N
Data  3 KI
  Tab Delimited (TSV)   2D SDfile   Computed 3D by Vconf -m prep SDfile
Find this compound or compounds like it in BindingDB:
Activity Spreadsheet -- Enzyme Inhibition Constant Data from BindingDB
Found 3 hits for monomerid = 50451375
TargetCarbonic anhydrase 2(Homo sapiens (Human))
Universit£
Curated by ChEMBL
LigandPNGBDBM50451375(CHEMBL3138387)
Affinity DataKi:  13nM. Assay description: Inhibitory activity against human recombinant carbonic anhydrase II (CA2)
In DepthDetails ArticlePubMed
TargetCarbonic anhydrase 4(Bos taurus (bovine))
Universit£
Curated by ChEMBL
LigandPNGBDBM50451375(CHEMBL3138387)
Affinity DataKi:  100nM. Assay description: Inhibitory activity against bovine carbonic anhydrase IV (CA4), obtained from bovine lung microsomes
In DepthDetails ArticlePubMed
TargetCarbonic anhydrase 1(Homo sapiens (Human))
Universit£
Curated by ChEMBL
LigandPNGBDBM50451375(CHEMBL3138387)
Affinity DataKi:  514nM. Assay description: Inhibitory activity against human recombinant carbonic anhydrase I (CA1)
In DepthDetails ArticlePubMed